BDBM50402032 CHEMBL2205452
SMILES O=c1c(NCC2CC2)c(Nc2ccnc(Nc3ccc(cc3)-c3ccccc3)n2)c1=O
InChI Key InChIKey=WAXRHCHSJASMPS-UHFFFAOYSA-N
Data  1 KI
  Tab Delimited (TSV)   2D SDfile   Computed 3D by Vconf -m prep SDfile
Find this compound or compounds like it in BindingDB:
Activity Spreadsheet -- Enzyme Inhibition Constant Data from BindingDB
Found 1 hit for monomerid = 50402032
TargetSerine/threonine-protein kinase PLK1(Homo sapiens (Human))
Abbott Laboratories
Curated by ChEMBL
LigandPNGBDBM50402032(CHEMBL2205452)
Affinity DataKi:  1.40E+4nM. Assay description: Inhibition of PLK1 in human MIAPaCa2 cells after 48 hrs by MTT assay
In DepthDetails ArticlePubMed