BDBM50402043 CHEMBL2205449
SMILES CC(C)(C)CNc1c(Nc2ccnc(Nc3ccc(cc3)-c3ccccc3)n2)c(=O)c1=O
InChI Key InChIKey=NCBMAIPCPSCCLT-UHFFFAOYSA-N
Data  1 KI
  Tab Delimited (TSV)   2D SDfile   Computed 3D by Vconf -m prep SDfile
Find this compound or compounds like it in BindingDB:
Activity Spreadsheet -- Enzyme Inhibition Constant Data from BindingDB
Found 1 hit for monomerid = 50402043
TargetSerine/threonine-protein kinase PLK1(Homo sapiens (Human))
Abbott Laboratories
Curated by ChEMBL
LigandPNGBDBM50402043(CHEMBL2205449)
Affinity DataKi:  1.80E+3nM. Assay description: Inhibition of PLK1 in human MIAPaCa2 cells after 48 hrs by MTT assay
In DepthDetails ArticlePubMed