BDBM50402317 CHEMBL2206106
SMILES Cn1c(SCc2cccc(Br)c2)nc2n(C)c(=O)n(C)c(=O)c12
InChI Key InChIKey=YVLONOZAJRPKTM-UHFFFAOYSA-N
Data  2 IC50
  Tab Delimited (TSV)   2D SDfile   Computed 3D by Vconf -m prep SDfile
Find this compound or compounds like it in BindingDB:
Activity Spreadsheet -- Enzyme Inhibition Constant Data from BindingDB
Found 2 hits for monomerid = 50402317
TargetAmine oxidase [flavin-containing] A(Homo sapiens (Human))
North-West University
Curated by ChEMBL
LigandPNGBDBM50402317(CHEMBL2206106)
Affinity DataIC50:  3.79E+4nM. Assay description: Inhibition of human recombinant MAO-A expressed in insect cell microsome assessed as 4-hydroxyquinoline formation using kynuramine as substrate after...
In DepthDetails ArticlePubMed
TargetAmine oxidase [flavin-containing] B(Homo sapiens (Human))
North-West University
Curated by ChEMBL
LigandPNGBDBM50402317(CHEMBL2206106)
Affinity DataIC50:  199nM. Assay description: Inhibition of human recombinant MAO-B expressed in insect cell microsome assessed as 4-hydroxyquinoline formation using kynuramine as substrate after...
In DepthDetails ArticlePubMed