BDBM50402337 CHEMBL2206660
SMILES OC[C@H]1O[C@H]([C@H](O)[C@@H]1O)n1cc(Cn2ccc(=O)[nH]c2=O)nn1
InChI Key InChIKey=HUSMKQOXUIOPRU-QCNRFFRDSA-N
Data  1 KI
  Tab Delimited (TSV)   2D SDfile   Computed 3D by Vconf -m prep SDfile
Find this compound or compounds like it in BindingDB:
Activity Spreadsheet -- Enzyme Inhibition Constant Data from BindingDB
Found 1 hit for monomerid = 50402337
TargetRibonuclease pancreatic(Bison bison (American bison))
University Of Thessaly
Curated by ChEMBL
LigandPNGBDBM50402337(CHEMBL2206660)
Affinity DataKi:  240nM. Assay description: Inhibition of bovine pancreatic RNase A
In DepthDetails ArticlePubMed