BDBM50402377 CHEMBL2206687
SMILES Nc1c(cc(-c2ccccc2)n1-c1ccccn1)C#N
InChI Key InChIKey=ARPIBFCWPPMIOH-UHFFFAOYSA-N
Data  1 KI
  Tab Delimited (TSV)   2D SDfile   Computed 3D by Vconf -m prep SDfile
Find this compound or compounds like it in BindingDB:
Activity Spreadsheet -- Enzyme Inhibition Constant Data from BindingDB
Found 1 hit for monomerid = 50402377
TargetUrokinase plasminogen activator surface receptor(Homo sapiens (Human))
National Research Center
Curated by ChEMBL
LigandPNGBDBM50402377(CHEMBL2206687)
Affinity DataKi:  0.0330nM. Assay description: Binding affinity to uPAR
In DepthDetails ArticlePubMed