BDBM50402459 CHEMBL2208301
SMILES [#7]\[#6](-[#7])=[#7]\[#6]-[#6]-[#6]-[#6@H](-[#7]-[#6](=O)-[#6]-[#6]-[#7]-1-c2ccccc2-[#16]-c2ccccc-12)-[#6](=O)-[#7]-[#6@@H](-[#6]-c1ccccc1)-[#6](-[#7])=O
InChI Key InChIKey=LWUANFDWSQXMON-VXKWHMMOSA-N
Data  1 KI
  Tab Delimited (TSV)   2D SDfile   Computed 3D by Vconf -m prep SDfile
Find this compound or compounds like it in BindingDB:
Activity Spreadsheet -- Enzyme Inhibition Constant Data from BindingDB
Found 1 hit for monomerid = 50402459
TargetNeuropeptide FF receptor 1(Homo sapiens (Human))
University Of Strasbourg
Curated by ChEMBL
LigandPNGBDBM50402459(CHEMBL2208301)
Affinity DataKi:  0.900nM. Assay description: Displacement of [3H]FFRF-NH2 from human flag-tagged NPFF1 receptor expressed in CHO cells by scintillation counting
In DepthDetails ArticlePubMed