BDBM50402703 CHEMBL2207370
SMILES Cc1ccc(cc1)S(=O)(=O)n1ccc2c(CN3CCNCC3)cccc12
InChI Key InChIKey=VYSPSXPMDGBZAE-UHFFFAOYSA-N
Data  1 KI
  Tab Delimited (TSV)   2D SDfile   Computed 3D by Vconf -m prep SDfile
Find this compound or compounds like it in BindingDB:
Activity Spreadsheet -- Enzyme Inhibition Constant Data from BindingDB
Found 1 hit for monomerid = 50402703
Target5-hydroxytryptamine receptor 6(Homo sapiens (Human))
Suven Life Sciences
Curated by ChEMBL
LigandPNGBDBM50402703(CHEMBL2207370)
Affinity DataKi:  10.7nM. Assay description: Displacement of [3H]-LSD from cloned human 5HT6 receptor expressed in HEK293 cells
In DepthDetails ArticlePubMed