BDBM50402734 CHEMBL2207781
SMILES CN(C(=O)c1ccccc1F)c1nnc(s1)-c1ccc(CN2CC(C2)C(O)=O)cc1
InChI Key InChIKey=SXZWLQJVHZTMHK-UHFFFAOYSA-N
Data  2 EC50
  Tab Delimited (TSV)   2D SDfile   Computed 3D by Vconf -m prep SDfile
Find this compound or compounds like it in BindingDB:
Activity Spreadsheet -- Enzyme Inhibition Constant Data from BindingDB
Found 2 hits for monomerid = 50402734
TargetSphingosine 1-phosphate receptor 3(Homo sapiens (Human))
RhôNe-Poulenc Rorer
Curated by ChEMBL
LigandPNGBDBM50402734(CHEMBL2207781)
Affinity DataEC50: >1.60E+4nM. Assay description: Agonist activity at S1P3 receptor by [35S]GTPgammaS binding assay
In DepthDetails ArticlePubMed
TargetSphingosine 1-phosphate receptor 1(Homo sapiens (Human))
RhôNe-Poulenc Rorer
Curated by ChEMBL
LigandPNGBDBM50402734(CHEMBL2207781)
Affinity DataEC50:  371nM. Assay description: Agonist activity at S1P1 receptor by [35S]GTPgammaS binding assay
In DepthDetails ArticlePubMed