BDBM50402749 CHEMBL2207812
SMILES O=C(NCc1ccco1)c1ccc2nc(COc3ccc(cc3)-c3ccccc3)[nH]c2c1
InChI Key InChIKey=VBTUYVBMTVQLAC-UHFFFAOYSA-N
Data  1 IC50
  Tab Delimited (TSV)   2D SDfile   Computed 3D by Vconf -m prep SDfile
Find this compound or compounds like it in BindingDB:
Activity Spreadsheet -- Enzyme Inhibition Constant Data from BindingDB
Found 1 hit for monomerid = 50402749
TargetDiacylglycerol O-acyltransferase 1(Rattus norvegicus (rat))
Dongguk University-Seoul
Curated by ChEMBL
LigandPNGBDBM50402749(CHEMBL2207812)
Affinity DataIC50: >5.00E+4nM. Assay description: Inhibition of DGAT in rat liver microsomes
In DepthDetails ArticlePubMed