BDBM50402762 CHEMBL2207799
SMILES O=C(N1CCCC1)c1ccc2nc(COc3ccc(cc3)C34CC5CC(CC(C5)C3)C4)[nH]c2c1
InChI Key InChIKey=AWINIWVGOSGGPM-UHFFFAOYSA-N
Data  1 IC50
  Tab Delimited (TSV)   2D SDfile   Computed 3D by Vconf -m prep SDfile
Find this compound or compounds like it in BindingDB:
Activity Spreadsheet -- Enzyme Inhibition Constant Data from BindingDB
Found 1 hit for monomerid = 50402762
TargetDiacylglycerol O-acyltransferase 1(Rattus norvegicus (rat))
Dongguk University-Seoul
Curated by ChEMBL
LigandPNGBDBM50402762(CHEMBL2207799)
Affinity DataIC50:  1.13E+4nM. Assay description: Inhibition of DGAT in rat liver microsomes
In DepthDetails ArticlePubMed