BDBM50402767 CHEMBL2205735
SMILES COC(=O)c1ccc2nc(COc3ccc(cc3)C34CC5CC(CC(C5)C3)C4)[nH]c2c1
InChI Key InChIKey=DDSDQTSUZNQOAY-UHFFFAOYSA-N
Data  1 IC50
  Tab Delimited (TSV)   2D SDfile   Computed 3D by Vconf -m prep SDfile
Find this compound or compounds like it in BindingDB:
Activity Spreadsheet -- Enzyme Inhibition Constant Data from BindingDB
Found 1 hit for monomerid = 50402767
TargetDiacylglycerol O-acyltransferase 1(Rattus norvegicus (rat))
Dongguk University-Seoul
Curated by ChEMBL
LigandPNGBDBM50402767(CHEMBL2205735)
Affinity DataIC50:  2.30E+4nM. Assay description: Inhibition of DGAT in rat liver microsomes
In DepthDetails ArticlePubMed