BDBM50402966 CHEMBL2206824
SMILES O[C@H]1CN[C@H](CN[C@@H](CNC(=O)c2ccccc2Br)c2ccccc2)[C@H]1O
InChI Key InChIKey=FSSLVXRVIVHSCK-ZSYWTGECSA-N
Data  2 KI
  Tab Delimited (TSV)   2D SDfile   Computed 3D by Vconf -m prep SDfile
Find this compound or compounds like it in BindingDB:
Activity Spreadsheet -- Enzyme Inhibition Constant Data from BindingDB
Found 2 hits for monomerid = 50402966
TargetEndoplasmic reticulum mannosyl-oligosaccharide 1,2-alpha-mannosidase(Homo sapiens (Human))
Universidade Do Porto 687
Curated by ChEMBL
LigandPNGBDBM50402966(CHEMBL2206824)
Affinity DataKi:  160nM. Assay description: Inhibition of human ER alpha mannosidase 1
In DepthDetails ArticlePubMed
TargetAlpha-mannosidase 2(Homo sapiens (Human))
Universidade Do Porto 687
Curated by ChEMBL
LigandPNGBDBM50402966(CHEMBL2206824)
Affinity DataKi:  4.35E+3nM. Assay description: Inhibition of human golgi alpha mannosidase 2
In DepthDetails ArticlePubMed