BDBM50403196 CHEMBL289880
SMILES OC(=O)CCC(Sc1ccc(cc1)C(O)=O)\C=C\Cc1ccc(OCCCCOc2ccccc2)cc1
InChI Key InChIKey=MHKAEITVUICXRN-UXBLZVDNSA-N
Data  1 Kd
  Tab Delimited (TSV)   2D SDfile   Computed 3D by Vconf -m prep SDfile
Find this compound or compounds like it in BindingDB:
Activity Spreadsheet -- Enzyme Inhibition Constant Data from BindingDB
Found 1 hit for monomerid = 50403196
TargetCysteinyl leukotriene receptor 1(GUINEA PIG)
TBA
Curated by ChEMBL
LigandPNGBDBM50403196(CHEMBL289880)
Affinity DataKd:  4nM. Assay description: Compound was evaluated for its antagonist affinity at 0.1 uM on guinea-pig trachea rings against LTD4 receptor
In DepthDetails Article