BDBM50403215 CHEMBL299741
SMILES CCc1nc(NCc2ccc(cc2)-c2ccccc2-c2nnn[nH]2)c2cc(OC)ccc2n1
InChI Key InChIKey=RWBDPTFGJRXCOK-UHFFFAOYSA-N
Data  1 Kd
  Tab Delimited (TSV)   2D SDfile   Computed 3D by Vconf -m prep SDfile
Find this compound or compounds like it in BindingDB:
Activity Spreadsheet -- Enzyme Inhibition Constant Data from BindingDB
Found 1 hit for monomerid = 50403215
TargetType-1 angiotensin II receptor(RABBIT)
TBA
Curated by ChEMBL
LigandPNGBDBM50403215(CHEMBL299741)
Affinity DataKd:  2.63nM. Assay description: pA2 value determined in vitro against angiotensin II receptor, type 1 using rabbit aortic rings
In DepthDetails Article