BDBM50403238 CHEMBL170196
SMILES CCOC(=O)\C=C1/CC2(CCCC2)C(=O)N1Cc1ccc(cc1)-c1ccccc1-c1nnn[nH]1
InChI Key InChIKey=RZNQMKRGLQLJKF-HMMYKYKNSA-N
Data  1 Kd
  Tab Delimited (TSV)   2D SDfile   Computed 3D by Vconf -m prep SDfile
Find this compound or compounds like it in BindingDB:
Activity Spreadsheet -- Enzyme Inhibition Constant Data from BindingDB
Found 1 hit for monomerid = 50403238
TargetType-1 angiotensin II receptor(RABBIT)
TBA
Curated by ChEMBL
LigandPNGBDBM50403238(CHEMBL170196)
Affinity DataKd:  3.16nM. Assay description: In vitro binding affinity against Angiotensin II receptor in rabbit aorta rings
In DepthDetails Article