BDBM50403254 CHEMBL51389
SMILES OC(=O)CN1c2ccccc2OC[C@H](NC(=O)[C@@H](CS)Cc2ccccc2)C1=O
InChI Key InChIKey=BLWJOUOTJGBSKF-CVEARBPZSA-N
Data  2 IC50
  Tab Delimited (TSV)   2D SDfile   Computed 3D by Vconf -m prep SDfile
Find this compound or compounds like it in BindingDB:
Activity Spreadsheet -- Enzyme Inhibition Constant Data from BindingDB
Found 2 hits for monomerid = 50403254
TargetNeprilysin(Homo sapiens (Human))
TBA
Curated by ChEMBL
LigandPNGBDBM50403254(CHEMBL51389)
Affinity DataIC50:  0.600nM. Assay description: Tested in vitro for inhibition of neutral endopeptidase (NEP)
In DepthDetails Article
TargetAngiotensin-converting enzyme(Homo sapiens (Human))
TBA
Curated by ChEMBL
LigandPNGBDBM50403254(CHEMBL51389)
Affinity DataIC50:  4.40nM. Assay description: Tested in vitro for inhibition of Angiotensin converting enzyme (ACE)
In DepthDetails Article