BDBM50403374 CHEMBL2062149::L-683742
SMILES CC[C@@H]1\C=C(C)\C[C@H](C)C[C@H](OC)[C@H]2O[C@](O)([C@@H](C)C[C@@H]2OC)C(=O)C(=O)N2CCCC[C@H]2C(=O)O[C@@H]([C@H](C)[C@@H](O)CC1=O)C(\C)=C\[C@@H]1CC[C@@H](O)[C@H](O)C1
InChI Key InChIKey=TXWGCZQZVCMIHR-PQKLHFQNSA-N
Data  1 EC50
  Tab Delimited (TSV)   2D SDfile   Computed 3D by Vconf -m prep SDfile
Find this compound or compounds like it in BindingDB:
Activity Spreadsheet -- Enzyme Inhibition Constant Data from BindingDB
Found 1 hit for monomerid = 50403374
TargetPeptidyl-prolyl cis-trans isomerase FKBP1A(Homo sapiens (Human))
TBA
Curated by ChEMBL
LigandPNGBDBM50403374(CHEMBL2062149 | L-683742)
Affinity DataEC50:  5nM. Assay description: Ability to bind the major cystolic receptor FK506 binding protein 12 by using competitive binding assay
In DepthDetails Article