BDBM50403635 CHEMBL553507
SMILES CCOC(=O)[C@H]1CC2(CCN(CC2)C(=O)[C@@H](Cc2c[nH]c3ccccc23)NC(=O)C(C)(C)N)c2ccccc12
InChI Key InChIKey=FOZKMUDHUVEEOZ-JYFHCDHNSA-N
Data  1 EC50
  Tab Delimited (TSV)   2D SDfile   Computed 3D by Vconf -m prep SDfile
Find this compound or compounds like it in BindingDB:
Activity Spreadsheet -- Enzyme Inhibition Constant Data from BindingDB
Found 1 hit for monomerid = 50403635
TargetGrowth hormone-releasing hormone receptor(Rattus norvegicus)
TBA
Curated by ChEMBL
LigandPNGBDBM50403635(CHEMBL553507)
Affinity DataEC50:  6nM. Assay description: Ability to release growth hormone in a rat pituitary cell assay
In DepthDetails Article