BDBM50403736 CHEMBL2113261
SMILES CC[C@@H]1[C@H](C)CNc2cc3[nH]c(=O)cc(c3cc12)C(F)(F)F
InChI Key InChIKey=IAOXLWDRNCVJBE-RKDXNWHRSA-N
Data  1 KI  1 IC50  1 EC50
  Tab Delimited (TSV)   2D SDfile   Computed 3D by Vconf -m prep SDfile
Find this compound or compounds like it in BindingDB:
Activity Spreadsheet -- Enzyme Inhibition Constant Data from BindingDB
Found 3 hits for monomerid = 50403736
TargetAndrogen receptor(Homo sapiens (Human))
Ligand Pharmaceuticals
Curated by ChEMBL
LigandPNGBDBM50403736(CHEMBL2113261)
Affinity DataKi:  27nM. Assay description: Binding affinity to the human androgen receptor (hAR), using [3H]DHT as radioligand in a competitive binding assay
In DepthDetails ArticlePubMed
TargetAndrogen receptor(Homo sapiens (Human))
Ligand Pharmaceuticals
Curated by ChEMBL
LigandPNGBDBM50403736(CHEMBL2113261)
Affinity DataIC50: >1.00E+4nM. Assay description: Agonist activity to the human androgen receptor (hAR) in CV-1 cells
In DepthDetails ArticlePubMed
TargetAndrogen receptor(Homo sapiens (Human))
Ligand Pharmaceuticals
Curated by ChEMBL
LigandPNGBDBM50403736(CHEMBL2113261)
Affinity DataEC50:  7nM. Assay description: Agonist activity to the human androgen receptor (hAR) in CV-1 cells
In DepthDetails ArticlePubMed