BDBM50403903 LAHERRADURIN
SMILES CCCCCCCCCC[C@H](O)[C@H]1CC[C@@H](O1)[C@H]1CC[C@@H](O1)[C@H](O)CCCCCCCCCCCCC1[C@@H](O)[C@H](C)OC1=O
InChI Key InChIKey=FTTBSOBXDJECAA-SLOXALGKSA-N
Data  1 IC50
  Tab Delimited (TSV)   2D SDfile   Computed 3D by Vconf -m prep SDfile
Find this compound or compounds like it in BindingDB:
Activity Spreadsheet -- Enzyme Inhibition Constant Data from BindingDB
Found 1 hit for monomerid = 50403903
LigandPNGBDBM50403903(LAHERRADURIN)
Affinity DataIC50:  0.180nM. Assay description: Inhibition of NADH oxidase activity in sub-mitochondrial particles from bovine heart
In DepthDetails ArticlePubMed