BDBM50403904 CHEMBL345841
SMILES CCCCCCCCCC[C@@H](O)[C@@H]1CC[C@H](O1)[C@@H](O)CC[C@H](O)[C@@H]1CC[C@@H](CCCCCCC[C@@H](O)CC2=C[C@H](C)OC2=O)O1
InChI Key InChIKey=HKMBLJVHVBJAIH-VGPOZDALSA-N
Data  1 IC50
  Tab Delimited (TSV)   2D SDfile   Computed 3D by Vconf -m prep SDfile
Find this compound or compounds like it in BindingDB:
Activity Spreadsheet -- Enzyme Inhibition Constant Data from BindingDB
Found 1 hit for monomerid = 50403904
LigandPNGBDBM50403904(CHEMBL345841)
Affinity DataIC50:  1.80nM. Assay description: Inhibition of NADH oxidase activity in sub-mitochondrial particles from bovine heart
In DepthDetails ArticlePubMed