BDBM50403925 CHEMBL311041
SMILES CC1(C)CC(=O)C=C(C1)OC(=O)C1CC1
InChI Key InChIKey=URYMCUXVCZBWKR-UHFFFAOYSA-N
Data  2 IC50
  Tab Delimited (TSV)   2D SDfile   Computed 3D by Vconf -m prep SDfile
Find this compound or compounds like it in BindingDB:
Activity Spreadsheet -- Enzyme Inhibition Constant Data from BindingDB
Found 2 hits for monomerid = 50403925
Target4-hydroxyphenylpyruvate dioxygenase(Sus scrofa)
Zhejiang University
Curated by ChEMBL
LigandPNGBDBM50403925(CHEMBL311041)
Affinity DataIC50:  331nM. Assay description: Concentration required to achieve 50% inhibition against 4-Hydroxyphenylpyruvate dioxygenase (HPPD) from pig liver; (observed value)
In DepthDetails ArticlePubMed
Target4-hydroxyphenylpyruvate dioxygenase(Sus scrofa)
Zhejiang University
Curated by ChEMBL
LigandPNGBDBM50403925(CHEMBL311041)
Affinity DataIC50:  330nM. Assay description: Concentration required to achieve 50% inhibition against 4-Hydroxyphenylpyruvate dioxygenase (HPPD) from pig liver
In DepthDetails ArticlePubMed