BDBM50403941 CHEMBL83459
SMILES [O-][N+](=O)c1ccc(s1)C(=O)N(C1CCN(Cc2ccccc2)CC1)c1ccc(Br)cc1
InChI Key InChIKey=JOPXNGPVIWEQPF-UHFFFAOYSA-N
Data  2 KI
  Tab Delimited (TSV)   2D SDfile   Computed 3D by Vconf -m prep SDfile
Find this compound or compounds like it in BindingDB:
Activity Spreadsheet -- Enzyme Inhibition Constant Data from BindingDB
Found 2 hits for monomerid = 50403941
TargetMuscarinic acetylcholine receptor M3(Homo sapiens (Human))
Universit£
Curated by ChEMBL
LigandPNGBDBM50403941(CHEMBL83459)
Affinity DataKi:  7.90nM. Assay description: In vitro affinity for muscarinic M3 receptor.
In DepthDetails ArticlePubMed
TargetMuscarinic acetylcholine receptor M2(Homo sapiens (Human))
Universit£
Curated by ChEMBL
LigandPNGBDBM50403941(CHEMBL83459)
Affinity DataKi:  316nM. Assay description: In vitro affinity for muscarinic M2 receptor.
In DepthDetails ArticlePubMed