BDBM50404098 CHEMBL146160
SMILES Clc1c(sc2ccccc12)C(=O)Nc1cccc(Cl)c1C(=O)Nc1ccc(Cl)cc1
InChI Key InChIKey=RBQNRRYPSXBPJI-UHFFFAOYSA-N
Data  3 KI
  Tab Delimited (TSV)   2D SDfile   Computed 3D by Vconf -m prep SDfile
Find this compound or compounds like it in BindingDB:
Activity Spreadsheet -- Enzyme Inhibition Constant Data from BindingDB
Found 3 hits for monomerid = 50404098
TargetTrypsin(Homo sapiens (Human))
Berlex Biosciences
Curated by ChEMBL
LigandPNGBDBM50404098(CHEMBL146160)
Affinity DataKi: >5.00E+3nM. Assay description: Inhibition constant against bovine trypsin
In DepthDetails ArticlePubMed
TargetProthrombin(Homo sapiens (Human))
Berlex Biosciences
Curated by ChEMBL
LigandPNGBDBM50404098(CHEMBL146160)
Affinity DataKi: >5.00E+3nM. Assay description: Inhibition constant against human thrombin
In DepthDetails ArticlePubMed
TargetCoagulation factor X(Homo sapiens (Human))
Berlex Biosciences
Curated by ChEMBL
LigandPNGBDBM50404098(CHEMBL146160)
Affinity DataKi: >5.00E+3nM. Assay description: Inhibition constant against human factor Xa
In DepthDetails ArticlePubMed