BDBM50404153 CHEMBL2052001
SMILES CCCNC(=O)Nc1cccc(c1)-c1cccc(C[C@H](NS(=O)(=O)c2c(C)cc(C)cc2C)C(O)=O)c1
InChI Key InChIKey=KTQPBYGWLZAFSS-VWLOTQADSA-N
Data  1 KI
  Tab Delimited (TSV)   2D SDfile   Computed 3D by Vconf -m prep SDfile
Find this compound or compounds like it in BindingDB:
Activity Spreadsheet -- Enzyme Inhibition Constant Data from BindingDB
Found 1 hit for monomerid = 50404153
TargetIntegrin alpha-V/beta-3(Homo sapiens (Human))
Bayer
Curated by ChEMBL
LigandPNGBDBM50404153(CHEMBL2052001)
Affinity DataKi: >1.00E+4nM. Assay description: Binding affinity towards vitronectin receptor (alpha V-beta3) was determined
In DepthDetails ArticlePubMed