BDBM50404949 CHEMBL4172657
SMILES FC(F)(F)c1ccc(cc1)-c1cc(-c2ccccc2)c2ncccc2n1
InChI Key InChIKey=CPPCHVGQMUOCCS-UHFFFAOYSA-O
Data  1 IC50
  Tab Delimited (TSV)   2D SDfile   Computed 3D by Vconf -m prep SDfile
Find this compound or compounds like it in BindingDB:
Activity Spreadsheet -- Enzyme Inhibition Constant Data from BindingDB
Found 1 hit for monomerid = 50404949
TargetDNA topoisomerase 1(Homo sapiens (Human))
Universidad De Le£N
Curated by ChEMBL
LigandPNGBDBM50404949(CHEMBL4172657)
Affinity DataIC50:  7.27E+4nM. Assay description: Inhibition of human Top1B expressed in Top1B deficient Saccharomyces cerevisiae EKY3 assessed as decrease in relaxation of supercoiled pSK DNA preinc...
In DepthDetails ArticlePubMed