BDBM50405105 CHEMBL53209
SMILES CCCCc1cccc(Nc2cc(=O)[nH]c(=O)[nH]2)c1
InChI Key InChIKey=VEXWFBBIOVSMQZ-UHFFFAOYSA-N
Data  2 KI
  Tab Delimited (TSV)   2D SDfile   Computed 3D by Vconf -m prep SDfile
Find this compound or compounds like it in BindingDB:
Activity Spreadsheet -- Enzyme Inhibition Constant Data from BindingDB
Found 2 hits for monomerid = 50405105
TargetDNA topoisomerase 3(Bacillus subtilis)
TBA
Curated by ChEMBL
LigandPNGBDBM50405105(CHEMBL53209)
Affinity DataKi:  4.65E+5nM. Assay description: Inhibition constant against Bacillus subtilis azp-12 DNA topoisomerase III (mutant enzyme).
In DepthDetails ArticlePubMed
TargetDNA topoisomerase 3(Bacillus subtilis)
TBA
Curated by ChEMBL
LigandPNGBDBM50405105(CHEMBL53209)
Affinity DataKi:  6.95E+5nM. Assay description: Inhibition constant against Bacillus subtilis DNA topoisomerase III (wild type).
In DepthDetails ArticlePubMed