BDBM50405129 CHEMBL1161478
SMILES ONCC(O)C(O)C(=O)COP(O)(O)=O
InChI Key InChIKey=LZPGYZGGPPENSX-UHFFFAOYSA-N
Data  1 IC50
  Tab Delimited (TSV)   2D SDfile   Computed 3D by Vconf -m prep SDfile
Find this compound or compounds like it in BindingDB:
Activity Spreadsheet -- Enzyme Inhibition Constant Data from BindingDB
Found 1 hit for monomerid = 50405129
TargetArabinose 5-phosphate isomerase KdsD(Salmonella typhimurium)
TBA
Curated by ChEMBL
LigandPNGBDBM50405129(CHEMBL1161478)
Affinity DataIC50:  8.70E+6nM. Assay description: Inhibitory activity against Arabinose-5-phosphate isomerase
In DepthDetails ArticlePubMed