BDBM50405134 CHEMBL1161470
SMILES COC1OC(COP(O)(O)=O)C(F)C1O
InChI Key InChIKey=MXBRZMDOXKAGTO-UHFFFAOYSA-N
Data  1 IC50
  Tab Delimited (TSV)   2D SDfile   Computed 3D by Vconf -m prep SDfile
Find this compound or compounds like it in BindingDB:
Activity Spreadsheet -- Enzyme Inhibition Constant Data from BindingDB
Found 1 hit for monomerid = 50405134
TargetArabinose 5-phosphate isomerase KdsD(Salmonella typhimurium)
TBA
Curated by ChEMBL
LigandPNGBDBM50405134(CHEMBL1161470)
Affinity DataIC50:  9.13E+7nM. Assay description: Inhibitory activity against Arabinose-5-phosphate isomerase
In DepthDetails ArticlePubMed