BDBM50405780 CHEMBL2369809
SMILES [#6]-[#6]-[#7]-[#6](=O)-[#6@@H]-1-[#6]-[#6]-[#6]-[#7]-1-[#6](=O)-[#6@H](-[#6]-[#6]-[#6]\[#7]=[#6](/[#7])-[#7])-[#7]-[#6](=O)-[#6@H](-[#6]-[#6](-[#6])-[#6])-[#7]-[#6](=O)-[#6@@H](-[#6]-[#6](-[#6])-[#6])-[#7]-[#6](=O)-[#6@H](-[#6]-c1ccc(-[#8])cc1)-[#7]-[#6](=O)-[#6@H](-[#6]-[#8])-[#7]-[#6](=O)\[#6]=[#6]\c1cccnc1
InChI Key InChIKey=KYOXZEMRCISIFE-LZEJJXOSSA-N
Data  1 KI
  Tab Delimited (TSV)   2D SDfile   Computed 3D by Vconf -m prep SDfile
Find this compound or compounds like it in BindingDB:
Activity Spreadsheet -- Enzyme Inhibition Constant Data from BindingDB
Found 1 hit for monomerid = 50405780
TargetLutropin-choriogonadotropic hormone receptor(Rattus norvegicus)
Abbott Laboratories
Curated by ChEMBL
LigandPNGBDBM50405780(CHEMBL2369809)
Affinity DataKi:  1.48E+3nM. Assay description: In vitro binding affinity for Luteinizing hormone releasing hormone receptor from rat pituitary cells, expressed as negative logarithm of the equilib...
In DepthDetails ArticlePubMed