BDBM50405998 CHEMBL300114
SMILES COc1ccc(Cc2cnc(N)nc2N)cc1OS(C)(=O)=O
InChI Key InChIKey=WKFJKDHKBGEBJS-UHFFFAOYSA-N
Data  4 KI
  Tab Delimited (TSV)   2D SDfile   Computed 3D by Vconf -m prep SDfile
Find this compound or compounds like it in BindingDB:
Activity Spreadsheet -- Enzyme Inhibition Constant Data from BindingDB
Found 4 hits for monomerid = 50405998
TargetDihydrofolate reductase(Escherichia coli)
Beijing Medical University
Curated by ChEMBL
LigandPNGBDBM50405998(CHEMBL300114)
Affinity DataKi:  1.10nM. Assay description: Apparent inhibitory (log 1/Ki) activity against Escherichia coli dihydrofolate reductase
In DepthDetails ArticlePubMed
TargetDihydrofolate reductase type 1(Escherichia coli)
Pomona College
Curated by ChEMBL
LigandPNGBDBM50405998(CHEMBL300114)
Affinity DataKi:  16nM. Assay description: Inhibitory activity against Escherichia coli dihydrofolate reductase
In DepthDetails ArticlePubMed
TargetDihydrofolate reductase(Lactobacillus casei)
Pomona College
Curated by ChEMBL
LigandPNGBDBM50405998(CHEMBL300114)
Affinity DataKi:  214nM. Assay description: Inhibitory activity against Lactobacillus casei dihydrofolate reductase
In DepthDetails ArticlePubMed
TargetDihydrofolate reductase(Gallus gallus (Chicken))
Pomona College
Curated by ChEMBL
LigandPNGBDBM50405998(CHEMBL300114)
Affinity DataKi:  2.95E+4nM. Assay description: Inhibitory activity against chicken liver dihydrofolate reductase
In DepthDetails ArticlePubMed