BDBM50406171 CHEMBL101927
SMILES O=C(NCCN1CCN(Cc2ccccc2)CC1)c1ccccc1
InChI Key InChIKey=LRJYSUQXFXGBMT-UHFFFAOYSA-N
Data  1 IC50
  Tab Delimited (TSV)   2D SDfile   Computed 3D by Vconf -m prep SDfile
Find this compound or compounds like it in BindingDB:
Activity Spreadsheet -- Enzyme Inhibition Constant Data from BindingDB
Found 2 hits for monomerid = 50406171
TargetPlasma kallikrein(Homo sapiens (Human))TBA
LigandPNGBDBM50406171(CHEMBL5283110)
Affinity DataIC50:  1.00E+4nM. Assay description: Antagonism against Tachykinin receptor 2 in rat vas deferens(RVD)
In DepthDetails
TargetPlasma kallikrein(Homo sapiens (Human))TBA
LigandPNGBDBM50406171(CHEMBL5283110)
Affinity DataIC50:  19nM. Assay description: In vitro inhibitory effect of histamine H3 antagonist on the electrically evoked contractile response of isolated guinea pig jejunum segments.
In DepthDetails