BDBM50406732 CHEMBL269731
SMILES CSCC[C@@H]1NC(=O)[C@@H](CC(C)C)N2C=CC(NC(=O)[C@@H](Cc3ccccc3)NC(=O)[C@H](Cc3ccc(O)cc3)NC(=O)[C@@H](CCC(N)=O)NC(=O)CNC1=O)C2=O
InChI Key InChIKey=OZKMIBSHXHXREB-PYMRPGBCSA-N
Data  2 Kd
  Tab Delimited (TSV)   2D SDfile   Computed 3D by Vconf -m prep SDfile
Find this compound or compounds like it in BindingDB:
Activity Spreadsheet -- Enzyme Inhibition Constant Data from BindingDB
Found 2 hits for monomerid = 50406732
TargetNeuromedin-K receptor(Rattus norvegicus)
Merck Sharp And Dohme Research Laboratories
Curated by ChEMBL
LigandPNGBDBM50406732(CHEMBL269731)
Affinity DataKd:  3.98E+3nM. Assay description: Tested for antagonist activity toward NK-3 receptor in rat portal vein against the agonist eledoisin
In DepthDetails ArticlePubMed
TargetSubstance-K receptor(Rattus norvegicus (Rat))
Merck Sharp And Dohme Research Laboratories
Curated by ChEMBL
LigandPNGBDBM50406732(CHEMBL269731)
Affinity DataKd:  1.00E+4nM. Assay description: Inhibition of eledoisin binding to NK-2 receptor in rat vas deferens
In DepthDetails ArticlePubMed