BDBM50407017 CHEMBL337053
SMILES CC(C)(C)NC(=O)[C@@H]1C[C@@H]2CCCC[C@@H]2CN1C[C@H](O)[C@H](Cc1ccccc1)NC(=O)[C@H](CC(N)=O)NC(=O)OCc1ccccc1
InChI Key InChIKey=KWJAFFUEDWUZAR-ZSYXOIPQSA-N
Data  1 IC50
  Tab Delimited (TSV)   2D SDfile   Computed 3D by Vconf -m prep SDfile
Find this compound or compounds like it in BindingDB:
Activity Spreadsheet -- Enzyme Inhibition Constant Data from BindingDB
Found 1 hit for monomerid = 50407017
TargetGag-Pol polyprotein [489-587](Human immunodeficiency virus type 1)
Washington University
Curated by ChEMBL
LigandPNGBDBM50407017(CHEMBL337053)
Affinity DataIC50:  2.70nM. Assay description: Inhibitory potency against HIV-1 protease
In DepthDetails ArticlePubMed