BDBM50407062 CHEMBL335676
SMILES CC(C)(C)NC(=O)[C@@H]1CCCN1C(=O)[C@H](O)[C@H](Cc1ccccc1)NC(=O)[C@H](CC(N)=O)NC(=O)OCc1ccccc1
InChI Key InChIKey=XCVUOCMQYKSJJR-JAYJDBRPSA-N
Data  2 IC50
  Tab Delimited (TSV)   2D SDfile   Computed 3D by Vconf -m prep SDfile
Find this compound or compounds like it in BindingDB:
Activity Spreadsheet -- Enzyme Inhibition Constant Data from BindingDB
Found 2 hits for monomerid = 50407062
TargetGag-Pol polyprotein [489-587](Human immunodeficiency virus type 1)
Syntex Research
Curated by ChEMBL
LigandPNGBDBM50407062(CHEMBL335676)
Affinity DataIC50:  3.10E+3nM. Assay description: Inhibitory activity of the Compound was tested against HIV protease enzyme.
In DepthDetails ArticlePubMed
TargetGag-Pol polyprotein [489-587](Human immunodeficiency virus type 1)
Syntex Research
Curated by ChEMBL
LigandPNGBDBM50407062(CHEMBL335676)
Affinity DataIC50:  3.10E+3nM. Assay description: Inhibitory potency against HIV-1 protease
In DepthDetails ArticlePubMed