BDBM50407173 CHEMBL70394
SMILES CC(C)(C)NC(=O)N(CC(O)[C@H](Cc1ccccc1)NC(=O)[C@H](CC(N)=O)NC(=O)OCc1ccccc1)C1CCCCC1
InChI Key InChIKey=AXYPLAIABYULIK-ZLBDCPSSSA-N
Data  1 IC50
  Tab Delimited (TSV)   2D SDfile   Computed 3D by Vconf -m prep SDfile
Find this compound or compounds like it in BindingDB:
Activity Spreadsheet -- Enzyme Inhibition Constant Data from BindingDB
Found 1 hit for monomerid = 50407173
TargetGag-Pol polyprotein [489-587](Human immunodeficiency virus type 1)
Washington University
Curated by ChEMBL
LigandPNGBDBM50407173(CHEMBL70394)
Affinity DataIC50:  29.0nM. Assay description: Inhibitory activity against HIV-1 Protease
In DepthDetails ArticlePubMed