BDBM50407220 CHEMBL5277072
SMILES CN(CCCCCCN)CCCCCCCCN(C)CCCCCCN
InChI Key InChIKey=DMWBCGUKIPQQNO-UHFFFAOYSA-N
Data  2 EC50
  Tab Delimited (TSV)   2D SDfile   Computed 3D by Vconf -m prep SDfile
Find this compound or compounds like it in BindingDB:
Activity Spreadsheet -- Enzyme Inhibition Constant Data from BindingDB
Found 2 hits for monomerid = 50407220
TargetToll-like receptor 1(Human)
Panjab University
Curated by ChEMBL
LigandPNGBDBM50407220(CHEMBL5277072)
Affinity DataEC50: >5nM. Assay description: Negative log concentration of antagonist was determined on 5-hydroxytryptamine 2B receptor of Rat stomach fundus
In DepthDetails PubMed
TargetToll-like receptor 1(Human)
Panjab University
Curated by ChEMBL
LigandPNGBDBM50407220(CHEMBL5277072)
Affinity DataEC50: >5nM. Assay description: Compound was evaluated for its antagonist affinity towards 5-hydroxytryptamine 4 receptor of rat
In DepthDetails PubMed