BDBM50407480 CHEMBL3137920
SMILES [H][C@@]12CC[C@H](OC(C)=O)[C@@]1(C)CC[C@@]1([H])[C@@]2([H])CC[C@@]2(O)[C@@H](Cl)C(=O)C(C[C@]12C)C(N)=O
InChI Key InChIKey=JVBFUVZEMULQSD-CQXXJCQUSA-N
Data  1 IC50
  Tab Delimited (TSV)   2D SDfile   Computed 3D by Vconf -m prep SDfile
Find this compound or compounds like it in BindingDB:
Activity Spreadsheet -- Enzyme Inhibition Constant Data from BindingDB
Found 1 hit for monomerid = 50407480
TargetProtein Tat(Human immunodeficiency virus type 1 (isolate PCV12...)
Sterling Winthrop Pharmaecuticals Research Division
Curated by ChEMBL
LigandPNGBDBM50407480(CHEMBL3137920)
Affinity DataIC50:  8.40E+3nM. Assay description: The compound was tested for inhibition of HIV-1 replication in SW480 cells using HIV tat assay
In DepthDetails ArticlePubMed