BDBM50407756 CHEMBL62911
SMILES C[N+]1(Cc2ccccc2)CCN(CC1)c1nc2ccsc2n2cccc12
InChI Key InChIKey=CHXZPUOMGXBHFG-UHFFFAOYSA-N
Data  6 IC50
  Tab Delimited (TSV)   2D SDfile   Computed 3D by Vconf -m prep SDfile
Find this compound or compounds like it in BindingDB:
Activity Spreadsheet -- Enzyme Inhibition Constant Data from BindingDB
Found 6 hits for monomerid = 50407756
Target5-hydroxytryptamine receptor 3A/3B(Rattus norvegicus)
Universit£
Curated by ChEMBL
LigandPNGBDBM50407756(CHEMBL62911)
Affinity DataIC50:  126nM. Assay description: Binding affinity towards 5-hydroxytryptamine 3 receptor
In DepthDetails ArticlePubMed
Target5-hydroxytryptamine receptor 2A(BOVINE)
Universit£
Curated by ChEMBL
LigandPNGBDBM50407756(CHEMBL62911)
Affinity DataIC50:  1.74E+4nM. Assay description: Binding affinity towards 5-hydroxytryptamine 2A receptor
In DepthDetails ArticlePubMed
Target5-hydroxytryptamine receptor 1B(Rattus norvegicus (Rat))
Universit£
Curated by ChEMBL
LigandPNGBDBM50407756(CHEMBL62911)
Affinity DataIC50:  4.07E+4nM. Assay description: Binding affinity for 5-hydroxytryptamine 1B receptor
In DepthDetails ArticlePubMed
Target5-hydroxytryptamine receptor 1A(Homo sapiens (Human))
Universit£
Curated by ChEMBL
LigandPNGBDBM50407756(CHEMBL62911)
Affinity DataIC50:  7.76E+3nM. Assay description: Binding affinity for 5-hydroxytryptamine 1A receptor
In DepthDetails ArticlePubMed
Target5-hydroxytryptamine receptor 2C(Homo sapiens (Human))
Universit£
Curated by ChEMBL
LigandPNGBDBM50407756(CHEMBL62911)
Affinity DataIC50:  1.55E+4nM. Assay description: Binding affinity towards 5-hydroxytryptamine 2C receptor
In DepthDetails ArticlePubMed
Target5-hydroxytryptamine receptor 1D(Sus scrofa)
Universit£
Curated by ChEMBL
LigandPNGBDBM50407756(CHEMBL62911)
Affinity DataIC50: >1.00E+5nM. Assay description: Binding affinity for 5-hydroxytryptamine 1D receptor
In DepthDetails ArticlePubMed