BDBM50407830 CHEMBL2115157
SMILES N[C@H]([C@H]1[C@H]([C@H]1c1ccccc1)C(O)=O)C(O)=O
InChI Key InChIKey=IFLWVSHRWAIVQF-QCLAVDOMSA-N
Data  2 KI  3 IC50  3 EC50
  Tab Delimited (TSV)   2D SDfile   Computed 3D by Vconf -m prep SDfile
Find this compound or compounds like it in BindingDB:
Activity Spreadsheet -- Enzyme Inhibition Constant Data from BindingDB
Found 8 hits for monomerid = 50407830
TargetMetabotropic glutamate receptor 1(Homo sapiens (Human))
Università
Curated by ChEMBL
LigandPNGBDBM50407830(CHEMBL2115157)
Affinity DataKi: >2.70E+5nM. Assay description: Binding affinity towards metabotropic glutamate receptor mGluR1
In DepthDetails ArticlePubMed
TargetMetabotropic glutamate receptor 4(Homo sapiens (Human))
Università
Curated by ChEMBL
LigandPNGBDBM50407830(CHEMBL2115157)
Affinity DataKi: >2.80E+5nM. Assay description: Binding affinity of the compound towards metabotropic glutamate receptor mGluR4a
In DepthDetails ArticlePubMed
TargetMetabotropic glutamate receptor 4(Homo sapiens (Human))
Università
Curated by ChEMBL
LigandPNGBDBM50407830(CHEMBL2115157)
Affinity DataIC50: >3.00E+5nM. Assay description: Concentration required for the half-maximal inhibition of cAMP hydrolysis in BHK cells expressing mGluR4
In DepthDetails ArticlePubMed
TargetMetabotropic glutamate receptor 4(Homo sapiens (Human))
Università
Curated by ChEMBL
LigandPNGBDBM50407830(CHEMBL2115157)
Affinity DataEC50: >3.00E+5nM. Assay description: Effective concentration against forskolin-stimulated cAMP formation in BHK cells expressing mGluR4 receptor
In DepthDetails ArticlePubMed
TargetMetabotropic glutamate receptor 1(Homo sapiens (Human))
Università
Curated by ChEMBL
LigandPNGBDBM50407830(CHEMBL2115157)
Affinity DataIC50: >3.00E+5nM. Assay description: Concentration required for the half-maximal inhibition of PI hydrolysis in BHK cells expressing mGluR1a
In DepthDetails ArticlePubMed
TargetMetabotropic glutamate receptor 2(Homo sapiens (Human))
Università
Curated by ChEMBL
LigandPNGBDBM50407830(CHEMBL2115157)
Affinity DataEC50: >3.00E+5nM. Assay description: Effective concentration forskolin-stimulated cAMP formation in BHK cells expressing mGluR2 receptor
In DepthDetails ArticlePubMed
TargetMetabotropic glutamate receptor 2(Homo sapiens (Human))
Università
Curated by ChEMBL
LigandPNGBDBM50407830(CHEMBL2115157)
Affinity DataIC50: >3.00E+5nM. Assay description: Concentration required for the half-maximal inhibition of cAMP hydrolysis in BHK cells expressing mGluR2
In DepthDetails ArticlePubMed
TargetMetabotropic glutamate receptor 1(Homo sapiens (Human))
Università
Curated by ChEMBL
LigandPNGBDBM50407830(CHEMBL2115157)
Affinity DataEC50: >3.00E+5nM. Assay description: Concentration required for half-maximal stimulation of PI hydrolysis in BHK cells expressing mGluR1a
In DepthDetails ArticlePubMed