BDBM50407852 CHEMBL1202891
SMILES Cc1ccc2NC3C(CCNC3Cc3cccc4ccccc34)c2c1
InChI Key InChIKey=UBWSICCCWLIMEQ-UHFFFAOYSA-N
Data  2 KI
  Tab Delimited (TSV)   2D SDfile   Computed 3D by Vconf -m prep SDfile
Find this compound or compounds like it in BindingDB:
Activity Spreadsheet -- Enzyme Inhibition Constant Data from BindingDB
Found 2 hits for monomerid = 50407852
Target5-hydroxytryptamine receptor 2C(Rattus norvegicus (Rat))
Eli Lilly
Curated by ChEMBL
LigandPNGBDBM50407852(CHEMBL1202891)
Affinity DataKi:  2.09nM. Assay description: Binding affinity towards 5-HT 2C receptor in rat stomach fundus
In DepthDetails ArticlePubMed
Target5-hydroxytryptamine receptor 2A(Rattus norvegicus (rat))
Eli Lilly
Curated by ChEMBL
LigandPNGBDBM50407852(CHEMBL1202891)
Affinity DataKi:  3.55nM. Assay description: Binding affinity for 5-HT 2A in rat stomach fundus
In DepthDetails ArticlePubMed