BDBM50408058 CHEMBL2028982
SMILES N[C@H](CCCNC(N)=N)C(=O)N[C@@H](CCCNC(N)=N)C(=O)N1CCC[C@H]1C(=O)N1CC(O)C[C@H]1C(=O)NCC(=O)N[C@@H](Cc1cccs1)C(=O)N[C@@H](CO)C(=O)N(CC(=O)N(CC(=O)N[C@@H](CCCNC(N)=N)C(O)=O)C1CCCCC1)Cc1ccccc1
InChI Key InChIKey=CWBPONYGQZTVKP-ZPPROKISSA-N
Data  1 IC50
  Tab Delimited (TSV)   2D SDfile   Computed 3D by Vconf -m prep SDfile
Find this compound or compounds like it in BindingDB:
Activity Spreadsheet -- Enzyme Inhibition Constant Data from BindingDB
Found 1 hit for monomerid = 50408058
TargetB1 bradykinin receptor(Homo sapiens (Human))
Cortech
Curated by ChEMBL
LigandPNGBDBM50408058(CHEMBL2028982)
Affinity DataIC50: >1.00E+4nM. Assay description: In vitro Bradykinin receptor B1 antagonist activity in functional tissue within rabbit aorta
In DepthDetails ArticlePubMed