BDBM50408327 CHEMBL137620
SMILES Clc1cccc2Oc3ccccc3Oc12
InChI Key InChIKey=VGGGRWRBGXENKI-UHFFFAOYSA-N
Data  1 EC50
  Tab Delimited (TSV)   2D SDfile   Computed 3D by Vconf -m prep SDfile
Find this compound or compounds like it in BindingDB:
Activity Spreadsheet -- Enzyme Inhibition Constant Data from BindingDB
Found 1 hit for monomerid = 50408327
TargetAryl hydrocarbon receptor(Homo sapiens (Human))
Harvard University
Curated by ChEMBL
LigandPNGBDBM50408327(CHEMBL137620)
Affinity DataEC50:  1.00E+5nM. Assay description: Affinity on cytosolic Aromatic hydrocarbon receptor (Ah)
In DepthDetails ArticlePubMed