BDBM50408371 CHEMBL136116
SMILES Clc1cc2Oc3c(Cl)c(Cl)c(Cl)c(Cl)c3Oc2cc1Cl
InChI Key InChIKey=WCYYQNSQJHPVMG-UHFFFAOYSA-N
Data  1 EC50
  Tab Delimited (TSV)   2D SDfile   Computed 3D by Vconf -m prep SDfile
Find this compound or compounds like it in BindingDB:
Activity Spreadsheet -- Enzyme Inhibition Constant Data from BindingDB
Found 1 hit for monomerid = 50408371
TargetAryl hydrocarbon receptor(Homo sapiens (Human))
Harvard University
Curated by ChEMBL
LigandPNGBDBM50408371(CHEMBL136116)
Affinity DataEC50:  280nM. Assay description: Affinity on cytosolic Aromatic hydrocarbon receptor (Ah)
In DepthDetails ArticlePubMed