BDBM50408541 CHEMBL134418
SMILES CN1C2CCC1C(C2)c1ccc(F)cc1
InChI Key InChIKey=BXGWCQDCHRVLAK-UHFFFAOYSA-N
Data  1 Kd
  Tab Delimited (TSV)   2D SDfile   Computed 3D by Vconf -m prep SDfile
Find this compound or compounds like it in BindingDB:
Activity Spreadsheet -- Enzyme Inhibition Constant Data from BindingDB
Found 1 hit for monomerid = 50408541
TargetNeuronal acetylcholine receptor subunit alpha-9(RAT)
National Institute On Drug Abuse
Curated by ChEMBL
LigandPNGBDBM50408541(CHEMBL134418)
Affinity DataKd:  0.0280nM. Assay description: The compound was tested for the inhibition of binding of [3H]epibatidine to central nicotinic acetylcholine receptor (nAChR) in rat brain.
In DepthDetails ArticlePubMed