BDBM50408726 CHEMBL128491
SMILES CCN(CC)C(=O)Cc1c(nc2ccccn12)-c1ccccc1
InChI Key InChIKey=VWBWMTJEXUYAHI-UHFFFAOYSA-N
Data  2 IC50
  Tab Delimited (TSV)   2D SDfile   Computed 3D by Vconf -m prep SDfile
Find this compound or compounds like it in BindingDB:
Activity Spreadsheet -- Enzyme Inhibition Constant Data from BindingDB
Found 2 hits for monomerid = 50408726
TargetTranslocator protein(Rattus norvegicus (rat))
Universit£
Curated by ChEMBL
LigandPNGBDBM50408726(CHEMBL128491)
Affinity DataIC50:  437nM. Assay description: Displacement of [3H]-PK 11195 from peripheral-type benzodiazepine receptor of rat cerebral cortex membranes
In DepthDetails ArticlePubMed
TargetTranslocator protein(Rattus norvegicus (rat))
Universit£
Curated by ChEMBL
LigandPNGBDBM50408726(CHEMBL128491)
Affinity DataIC50:  525nM. Assay description: Displacement of [3H]-PK 11195 from peripheral-type benzodiazepine receptor of rat ovary membranes
In DepthDetails ArticlePubMed