BDBM50409078 CHEMBL325761
SMILES Cc1c(C)c(=O)oc2cc(OCc3ccc(F)c(F)c3)ccc12
InChI Key InChIKey=OAIPPRYRUKGVPD-UHFFFAOYSA-N
Data  10 IC50
  Tab Delimited (TSV)   2D SDfile   Computed 3D by Vconf -m prep SDfile
Find this compound or compounds like it in BindingDB:
Activity Spreadsheet -- Enzyme Inhibition Constant Data from BindingDB
Found 10 hits for monomerid = 50409078
TargetAmine oxidase [flavin-containing] B(Rattus norvegicus (rat))
Universit£
Curated by ChEMBL
LigandPNGBDBM50409078(CHEMBL325761)
Affinity DataIC50:  1.10nM. Assay description: Inhibitory activity against monoamine oxidase B
In DepthDetails ArticlePubMed
TargetAmine oxidase [flavin-containing] A(Rattus norvegicus (rat))
Universit£
Curated by ChEMBL
LigandPNGBDBM50409078(CHEMBL325761)
Affinity DataIC50:  123nM. Assay description: Inhibitory activity against monoamine oxidase A
In DepthDetails ArticlePubMed
TargetAmine oxidase [flavin-containing] A(Rattus norvegicus (rat))
Universit£
Curated by ChEMBL
LigandPNGBDBM50409078(CHEMBL325761)
Affinity DataIC50:  123nM. Assay description: Inhibitory effect on monoamine oxidase A, SD on IC50 values < 10%
In DepthDetails ArticlePubMed
TargetAmine oxidase [flavin-containing] B(Rattus norvegicus (rat))
Universit£
Curated by ChEMBL
LigandPNGBDBM50409078(CHEMBL325761)
Affinity DataIC50:  1.15nM. Assay description: Inhibitory effect on Monoamine oxidase B, SD on IC50 values < 10%
In DepthDetails ArticlePubMed
TargetAmine oxidase [flavin-containing] B(Rattus norvegicus (rat))
Universit£
Curated by ChEMBL
LigandPNGBDBM50409078(CHEMBL325761)
Affinity DataIC50:  1.10nM. Assay description: Competitive inhibition of rat brain MAO-B
In DepthDetails ArticlePubMed
TargetAmine oxidase [flavin-containing] A(Homo sapiens (Human))
China Pharmaceutical University
Curated by ChEMBL
LigandPNGBDBM50409078(CHEMBL325761)
Affinity DataIC50: >1.00E+5nM. Assay description: Inhibition of recombinant human MAO-A using p-tyramine as substrate assessed as decrease in H2O2 production incubated for 15 mins by fluorimetric met...
In DepthDetails ArticlePubMed
TargetAmine oxidase [flavin-containing] B(Homo sapiens (Human))
China Pharmaceutical University
Curated by ChEMBL
LigandPNGBDBM50409078(CHEMBL325761)
Affinity DataIC50:  4.30nM. Assay description: Inhibition of recombinant human MAO-B using p-tyramine as substrate assessed as decrease in H2O2 production incubated for 15 mins by fluorimetric met...
In DepthDetails ArticlePubMed
TargetAmine oxidase [flavin-containing] B(Rattus norvegicus (rat))
Universit£
Curated by ChEMBL
LigandPNGBDBM50409078(CHEMBL325761)
Affinity DataIC50:  1nM. Assay description: Inhibition of rat brain mitochondrial MAOB using kynuramine as substrate assessed as decrease in 4-hydroxyquinoline production by spectrophotometry
In DepthDetails ArticlePubMed
TargetAmine oxidase [flavin-containing] B(Homo sapiens (Human))
China Pharmaceutical University
Curated by ChEMBL
LigandPNGBDBM50409078(CHEMBL325761)
Affinity DataIC50:  1.10nM. Assay description: Inhibition of MAO-B (unknown origin)
In DepthDetails ArticlePubMed
TargetAmine oxidase [flavin-containing] A(Rattus norvegicus (rat))
Universit£
Curated by ChEMBL
LigandPNGBDBM50409078(CHEMBL325761)
Affinity DataIC50:  123nM. Assay description: Inhibition of rat brain mitochondrial MAOA using kynuramine as substrate assessed as decrease in 4-hydroxyquinoline production by spectrophotometry
In DepthDetails ArticlePubMed