BDBM50409085 CHEMBL144555
SMILES C(Oc1ccc2OCOc2c1)c1ccccc1
InChI Key InChIKey=JEUUXPKQEVMAEC-UHFFFAOYSA-N
Data  2 IC50
  Tab Delimited (TSV)   2D SDfile   Computed 3D by Vconf -m prep SDfile
Find this compound or compounds like it in BindingDB:
Activity Spreadsheet -- Enzyme Inhibition Constant Data from BindingDB
Found 2 hits for monomerid = 50409085
TargetAmine oxidase [flavin-containing] B(Rattus norvegicus (rat))
Universit£
Curated by ChEMBL
LigandPNGBDBM50409085(CHEMBL144555)
Affinity DataIC50:  2.40E+3nM. Assay description: Inhibitory effect on Monoamine oxidase B, SD on IC50 values < 10%
In DepthDetails ArticlePubMed
TargetAmine oxidase [flavin-containing] B(Homo sapiens (Human))
North-West University
Curated by ChEMBL
LigandPNGBDBM50409085(CHEMBL144555)
Affinity DataIC50:  513nM. Assay description: Inhibition of human recombinant MAOB using kynuramine substrate assessed as reduction in MAO-generated 4-hydroxyquinoline level by fluorescence spect...
In DepthDetails ArticlePubMed