BDBM50409410 DISOMOTIDE
SMILES CC[C@H](C)[C@H](N)C(=O)N[C@@H](CCSC)C(=O)N[C@@H](CC(O)=O)C(=O)N[C@@H](CCC(N)=O)C(=O)N[C@@H](C(C)C)C(=O)N1CCC[C@H]1C(=O)N[C@@H](Cc1ccccc1)C(=O)N[C@@H](CO)C(=O)N[C@@H](C(C)C)C(O)=O
InChI Key InChIKey=BDQMCYCLZBSYJZ-BBXCZNCNSA-N
Data  1 IC50
  Tab Delimited (TSV)   2D SDfile   Computed 3D by Vconf -m prep SDfile
Find this compound or compounds like it in BindingDB:
Activity Spreadsheet -- Enzyme Inhibition Constant Data from BindingDB
Found 1 hit for monomerid = 50409410
TargetHLA class I histocompatibility antigen, A alpha chain(Homo sapiens (Human))
Edward Jenner Institute For Vaccine Research
Curated by ChEMBL
LigandPNGBDBM50409410(DISOMOTIDE)
Affinity DataIC50:  19.1nM. Assay description: MHC class I HLA-A*0201 binding affinity assayed by based inhibition of binding of a radiolabeled standard peptide (FLPSDYFPSV)
In DepthDetails ArticlePubMed