BDBM50409548 CHEMBL29790
SMILES Cc1cccc(c1O)C(C)(C)C
InChI Key InChIKey=BKZXZGWHTRCFPX-UHFFFAOYSA-N
Data  2 EC50
  Tab Delimited (TSV)   2D SDfile   Computed 3D by Vconf -m prep SDfile
Find this compound or compounds like it in BindingDB:
Activity Spreadsheet -- Enzyme Inhibition Constant Data from BindingDB
Found 2 hits for monomerid = 50409548
TargetGamma-aminobutyric acid receptor subunit alpha-1/beta-2/gamma-2(Homo sapiens (Human))
University Of Chicago Medical Center
Curated by ChEMBL
LigandPNGBDBM50409548(CHEMBL29790)
Affinity DataEC50:  501nM. Assay description: Potentiation of GABA responses at human Gamma-aminobutyric acid A receptor alpha-1-beta-2-gamma-2
In DepthDetails ArticlePubMed
TargetGamma-aminobutyric acid receptor subunit alpha-1/beta-2/gamma-2(Homo sapiens (Human))
University Of Chicago Medical Center
Curated by ChEMBL
LigandPNGBDBM50409548(CHEMBL29790)
Affinity DataEC50:  2.00E+4nM. Assay description: Direct activation of human Gamma-aminobutyric acid A receptor alpha-1-beta-2-gamma-2
In DepthDetails ArticlePubMed